{"text_format":"1","workbook":"xlsx","n_sheets":13,"sheets":["説明(Instruction)","基本情報(Data)","論文情報(Papers)","チェックシート(CheckSheet)","Form1学位申請書","Form2論文目録","Form3学位論文要旨","Form4履歴書","Form5承諾書","学位論文題目届 (Title of Dissertation)","研究題目変更願(request for change)","機関リポジトリ登録申請書(Repository)","英文氏名国名届(Name and nationality)"],"not_rendered":{"charts":0,"images":0,"macros":1,"external_links":0,"defined_names":13,"comments":0,"pivot_tables":0},"unopened":[],"bounds":{"document_bytes":16777216,"sheet_cells":100000,"rows_first":2000,"rows_last":500,"rows_between":2000,"halvings":0,"cell_chars":16384,"cell_head_chars":4096},"cells_cut":0,"cells_raw":0,"read":"whole","date_system":"1900"}

{"sheet":"説明(Instruction)","index":0,"n_rows":43,"n_cols":7,"rows_kept":43,"cut":false,"hidden":false,"merged":[[14,1,14,8],[7,0,7,8],[8,0,8,8],[9,0,9,8],[6,0,6,8],[13,0,13,8],[0,6,0,8],[1,6,1,8],[3,0,3,8],[4,0,4,8],[11,1,11,3],[35,0,35,1],[16,1,16,8],[17,1,17,8],[18,1,18,8],[19,1,19,8],[20,2,20,8],[21,2,21,8],[22,2,22,8],[29,2,29,8],[30,2,30,8],[31,2,31,8],[32,2,32,8],[33,2,33,8],[15,0,15,8],[24,2,24,8],[42,1,42,8],[36,1,36,8],[37,1,37,8],[38,1,38,8],[39,1,39,8],[40,1,40,8],[41,1,41,8],[35,2,35,8],[23,1,23,8],[25,1,25,8],[26,2,26,8],[27,2,27,8],[28,2,28,8],[34,2,34,8]]}
[null,null,null,null,null,null,"課程博士"]
[null,null,null,null,null,null,"Course Doctorate"]
[]
["学位申請の仕方"]
["How to make Doctoral Application"]
[]
{"$rows_left_out":38}
{"sheet":"基本情報(Data)","index":1,"n_rows":43,"n_cols":8,"rows_kept":43,"cut":false,"hidden":false,"merged":[[24,1,24,8],[38,5,38,7],[14,2,15,2],[32,2,32,4],[27,2,27,4],[27,5,27,7],[0,0,0,6],[18,1,19,1],[16,5,16,6],[17,5,17,6],[2,2,3,2],[10,2,11,2],[2,1,17,1],[16,2,17,2],[4,2,5,2],[6,2,7,2],[8,2,9,2],[12,2,13,2]]}
["基本情報入力シート　Sheet for Basic Information"]
[]
[null,"申請者　Applicant","Application, Admission Dates, Language/ 申請日・入学年・言語","Application date（y/m/d）/ 申請年月日","Matriculation (date of admission)（y/m/d）/ 入学年月日","Language used in Dissertation/学位論文で用いる言語","Name-displaying order/名前表記順番"]
[]
[null,null," Name (to be written on your certificate)/ローマ字表記氏名","Family Name/ 姓","Middle Name","First (Given) Name/名","Name / 氏名(automatically filled)"]
[null,null,null,null,null,null,{"$f":"IF($F$6=\"\",\"\",IF($D$6=\"\",$F$6,IF($G$12=\"\",IF($G$4=\"First-(Middle)-Family\",IF($E$6=\"\",$F$6&\" \"&$D$6,$F$6&\" \"&$E$6&\" \"&$D$6),IF($E$6=\"\",$D$6&\" \"&$F$6,$D$6&\" \"&$E$6&\" \"&$F$6)),IF($E$6=\"\",UPPER($D$6)&\", \"&$F$6,UPPER($D$6)&\", \"&$F$6&\" \"&$E$6))))","v":""}]
{"$rows_left_out":38}
{"sheet":"論文情報(Papers)","index":2,"n_rows":84,"n_cols":28,"rows_kept":84,"cut":false,"hidden":false,"merged":[[3,1,3,30],[8,2,8,30],[4,5,4,30],[14,2,14,20],[13,2,13,20],[5,5,5,30],[4,1,4,4],[5,1,5,4],[7,2,7,30],[28,3,28,8],[21,2,21,30],[15,12,15,19],[18,20,18,22],[20,1,31,1],[22,2,22,30],[23,2,23,30],[24,2,24,30],[25,2,25,30],[26,21,26,30],[27,21,27,30],[7,1,18,1],[27,2,27,20],[10,2,10,30],[11,2,11,30],[9,2,9,30],[12,2,12,30],[14,21,14,30],[13,21,13,30],[17,16,17,30],[17,2,17,15],[18,3,18,14],[15,22,15,29],[20,2,20,30],[83,24,83,26],[73,2,73,30],[72,2,72,30],[82,2,82,15],[82,16,82,30],[63,2,63,30],[60,2,60,30],[81,3,81,16],[81,19,81,30],[70,24,70,26],[72,1,83,1],[78,2,78,20],[79,2,79,20],[80,3,80,8],[80,12,80,19],[70,3,70,14],[70,20,70,22],[83,3,83,14],[83,20,83,22],[36,2,36,30],[37,2,37,30],[38,2,38,30],[39,21,39,30],[40,21,40,30],[41,22,41,29],[59,1,70,1],[65,2,65,20],[66,2,66,20],[67,3,67,8],[67,12,67,19],[69,16,69,30],[33,1,44,1],[46,1,57,1],[52,2,52,20],[53,2,53,20],[54,3,54,8],[54,12,54,19],[41,3,41,8],[64,2,64,30],[65,21,65,30],[66,21,66,30],[67,22,67,29],[69,2,69,15],[56,2,56,15],[56,16,56,30],[57,3,57,14],[57,20,57,22],[57,24,57,26],[61,2,61,30],[62,2,62,30],[59,2,59,30],[68,3,68,16],[68,19,68,30],[4,33,4,58],[0,0,1,31],[74,2,74,30],[75,2,75,30],[76,2,76,30],[77,2,77,30],[78,21,78,30],[79,21,79,30],[80,22,80,29],[47,2,47,30],[48,2,48,30],[49,2,49,30],[50,2,50,30],[51,2,51,30],[52,21,52,30],[53,21,53,30],[54,22,54,29],[43,2,43,15],[43,16,43,30],[44,3,44,14],[44,20,44,22],[44,24,44,26],[41,12,41,19],[39,2,39,20],[5,33,5,58],[16,3,16,16],[16,19,16,30],[29,3,29,16],[29,19,29,30],[42,3,42,16],[42,19,42,30],[55,3,55,16],[55,19,55,30],[28,22,28,29],[28,12,28,19],[30,2,30,15],[30,16,30,30],[31,3,31,14],[31,20,31,22],[31,24,31,26],[33,2,33,30],[18,24,18,26],[15,3,15,8],[26,2,26,20],[40,2,40,20],[46,2,46,30],[34,2,34,30],[35,2,35,30]]}
["論文情報入力シート　Sheet for Dessertation and Papers Information"]
[]
[]
[null,"学位論文題目 Title of Dissertation"]
[null,"学位論文（英文）Dissertation (in English)"]
[null,"学位論文（和文）\nDissertation (in Japanese)"]
{"$rows_left_out":79}
{"sheet":"チェックシート(CheckSheet)","index":3,"n_rows":52,"n_cols":73,"rows_kept":52,"cut":false,"hidden":false,"merged":[[51,0,51,54],[50,55,50,73],[51,55,51,73],[45,0,45,2],[46,3,46,75],[45,3,45,75],[47,3,47,75],[48,3,48,75],[49,0,49,75],[50,0,50,54],[43,46,43,53],[43,72,43,75],[44,0,44,45],[44,46,44,53],[44,72,44,75],[43,54,43,71],[44,54,44,71],[41,46,41,53],[41,72,41,75],[42,0,42,45],[42,46,42,53],[42,72,42,75],[41,54,41,57],[41,58,41,64],[41,65,41,71],[42,54,42,71],[39,46,39,53],[39,72,39,75],[40,0,40,45],[40,46,40,53],[40,72,40,75],[39,54,39,57],[39,58,39,64],[39,65,39,71],[40,54,40,71],[37,46,37,53],[37,72,37,75],[38,0,38,45],[38,46,38,53],[38,72,38,75],[37,54,37,57],[38,54,38,57],[37,58,37,64],[37,65,37,71],[38,58,38,64],[38,65,38,71],[35,46,35,53],[35,72,35,75],[36,0,36,45],[36,46,36,53],[36,72,36,75],[35,54,35,57],[36,54,36,57],[35,58,35,64],[35,65,35,71],[36,58,36,64],[36,65,36,71],[33,46,33,53],[33,72,33,75],[34,0,34,45],[34,46,34,53],[34,72,34,75],[33,54,33,57],[34,54,34,57],[33,58,33,64],[33,65,33,71],[34,58,34,64],[34,65,34,71],[4,0,4,32],[7,46,7,53],[23,0,23,33],[15,0,15,45],[16,0,16,45],[17,0,17,45],[18,0,18,45],[14,46,14,53],[15,46,15,53],[16,46,16,53],[5,0,5,45],[19,2,19,75],[20,2,20,75],[21,2,21,75],[22,2,22,75],[6,0,6,45],[7,0,7,45],[8,0,8,45],[11,0,11,45],[9,0,9,45],[10,0,10,45],[12,46,12,53],[13,46,13,53],[11,46,11,53],[30,0,30,75],[33,0,33,45],[35,0,35,45],[37,0,37,45],[39,0,39,45],[41,0,41,45],[43,0,43,45],[17,46,17,53],[18,46,18,53],[31,46,31,53],[31,72,31,75],[32,0,32,45],[32,46,32,53],[32,72,32,75],[31,54,31,57],[32,54,32,57],[31,58,31,64],[31,65,31,71],[32,58,32,64],[32,65,32,71],[31,0,31,45],[24,55,24,67],[25,55,25,67],[24,0,24,54],[15,60,15,65],[15,54,15,59],[29,37,29,44],[29,18,29,23],[12,0,12,45],[13,0,13,45],[14,0,14,45],[16,54,16,71],[17,54,17,71],[12,66,12,71],[13,66,13,71],[15,66,15,71],[14,54,14,71],[18,54,18,71],[25,0,25,54],[28,0,28,75],[29,0,29,7],[29,8,29,16],[29,24,29,35],[29,45,29,54],[29,56,29,67],[5,72,5,75],[5,66,5,71],[5,60,5,65],[5,54,5,59],[5,46,5,53],[9,66,9,71],[10,66,10,71],[6,60,6,65],[7,60,7,65],[8,60,8,65],[9,60,9,65],[10,60,10,65],[8,46,8,53],[9,46,9,53],[10,46,10,53],[6,46,6,53],[6,66,6,71],[7,66,7,71],[8,66,8,71],[6,72,6,75],[7,72,7,75],[8,72,8,75],[9,72,9,75],[10,72,10,75],[11,60,11,65],[6,54,6,59],[7,54,7,59],[8,54,8,59],[9,54,9,59],[10,54,10,59],[11,54,11,59],[12,54,12,59],[13,54,13,59],[12,60,12,65],[13,60,13,65],[1,0,1,75],[3,0,3,7],[3,19,3,23],[3,8,3,16],[3,24,3,35],[3,38,3,44],[3,45,3,54],[3,57,3,63],[3,64,3,75],[11,72,11,75],[12,72,12,75],[13,72,13,75],[14,72,14,75],[15,72,15,75],[16,72,16,75],[17,72,17,75],[18,72,18,75],[11,66,11,71]]}
[]
["学位論文申請関係書類チェックシート　List of documents required for degree application"]
[]
["所属構成大学:",null,null,null,null,null,null,null,{"$f":"IF(COUNTBLANK('基本情報(Data)'!G14)=0, VLOOKUP('基本情報(Data)'!G14,'基本情報(Data)'!$F$40:$H$41,2,0),\"\")","v":""},null,null,null,null,null,null,null,null,null,null,"申　請　者:",null,null,null,null,{"$f":"IF(OR('基本情報(Data)'!$F$4=\"英語 English/学位記氏名漢字 kanji\",'基本情報(Data)'!$F$4=\"日本語 Japanese\"),IF(COUNTBLANK('基本情報(Data)'!$G$8)=0,'基本情報(Data)'!$G$8,IF(COUNTBLANK('基本情報(Data)'!$G$6)=0,'基本情報(Data)'!$G$6,\"\")), IF(COUNTBLANK('基本情報(Data)'!$G$6)=0,'基本情報(Data)'!$G$6,\"\"))","v":""},null,null,null,null,null,null,null,null,null,null,null,null,null,"主指導教員:",null,null,null,null,null,null,{"$f":"IF(COUNTBLANK('基本情報(Data)'!D20)=0,'基本情報(Data)'!D20,IF(COUNTBLANK('基本情報(Data)'!E20)=0,'基本情報(Data)'!E20,\"\"))","v":""},null,null,null,null,null,null,null,null,null,null,null,"代議員会委員:",null,null,null,null,null,null,{"$f":"IF('基本情報(Data)'!F20<>\"\",VLOOKUP('基本情報(Data)'!F20,'基本情報(Data)'!$F$29:$H$38,2,0),\"\")","v":""}]
["Ⅰ）下記の提出書類等について確認し、✓印をつけること。"]
["提　　　出　　　書　　　類",null,null,null,null,null,null,null,null,null,null,null,null,null,null,null,null,null,null,null,null,null,null,null,null,null,null,null,null,null,null,null,null,null,null,null,null,null,null,null,null,null,null,null,null,null,"提出部数",null,null,null,null,null,null,null,"申  請  者",null,null,null,null,null,"主指導教員",null,null,null,null,null,"代議員会委員",null,null,null,null,null,"備　考"]
{"$rows_left_out":47}
{"sheet":"Form1学位申請書","index":4,"n_rows":47,"n_cols":28,"rows_kept":47,"cut":false,"hidden":false,"merged":[[11,18,11,20],[1,19,3,19],[1,20,3,21],[1,22,3,24],[1,13,3,14],[1,15,3,15],[1,16,3,16],[1,17,3,17],[1,18,3,18],[14,1,14,10],[1,2,3,4],[1,6,3,7],[1,8,3,8],[1,12,3,12],[1,11,3,11],[25,20,25,22],[19,17,19,27],[36,1,37,29],[43,2,43,6],[24,16,24,17],[0,0,0,5],[0,6,0,12],[15,1,15,10],[23,10,23,12],[1,0,3,1],[1,5,3,5],[18,10,18,13],[19,10,19,13],[7,7,7,21],[0,13,0,19],[0,20,0,25],[18,17,18,18],[1,9,3,9],[1,10,3,10],[5,0,5,14],[11,22,11,23],[1,25,3,25],[11,25,11,26],[8,7,8,21],[42,2,42,6],[24,10,24,13],[22,10,22,13],[25,10,25,14],[12,20,12,22],[12,23,12,25],[24,19,24,20],[42,23,42,24],[30,25,30,27],[20,10,20,20],[20,25,20,27],[12,26,12,28],[25,17,25,19],[44,2,44,6],[45,2,45,6],[46,2,46,6],[26,10,26,20],[40,2,40,28],[34,1,34,29],[35,1,35,29],[29,17,29,27],[29,12,29,14],[30,12,30,14],[28,17,28,18],[45,23,45,24],[46,23,46,24],[43,23,43,24],[44,23,44,24]]}
["受 付 番 号",null,null,null,null,null,"受 付 年 月 日",null,null,null,null,null,null,"受 理 年 月 日",null,null,null,null,null,null,"報 告 番 号"]
["甲第",null,null,null,null,"号",null,null,"年",null,"月",null,"日",null,null,"年",null,"月",null,"日","甲第",null,null,null,null,"号"]
[]
[]
[]
["別紙様式第１号（第4条関係）Form No.1"]
{"$rows_left_out":42}
{"sheet":"Form2論文目録","index":5,"n_rows":35,"n_cols":18,"rows_kept":35,"cut":false,"hidden":false,"merged":[[21,2,21,30],[22,2,22,30],[15,0,15,1],[16,0,16,1],[17,0,17,1],[18,0,18,1],[19,0,19,1],[20,0,20,1],[21,0,21,1],[22,0,22,1],[15,2,15,30],[18,2,18,30],[19,2,19,30],[20,2,20,30],[10,0,10,4],[9,0,9,4],[10,5,10,30],[16,2,16,30],[17,2,17,30],[13,0,13,16],[9,5,9,30],[8,2,8,30],[7,1,7,11],[5,14,5,16],[6,14,6,16],[0,0,0,14],[2,8,2,22],[3,8,3,22],[5,17,5,30],[24,0,24,16],[26,0,26,1],[26,2,26,30],[27,0,27,1],[27,2,27,30],[28,0,28,1],[28,2,28,30],[29,0,29,1],[29,2,29,30],[30,0,30,1],[30,2,30,30],[34,0,34,1],[34,2,34,30],[31,0,31,1],[31,2,31,30],[32,0,32,1],[32,2,32,30],[33,0,33,1],[33,2,33,30]]}
["別紙様式第２号（第4条関係）Form No.2"]
[]
[null,null,null,null,null,null,null,null,"論　文　目　録"]
[null,null,null,null,null,null,null,null,"LIST OF PUBLICATION"]
[]
[null,null,null,null,null,null,null,null,null,null,null,null,null,null,"氏　名",null,null,{"$f":"IF(OR('基本情報(Data)'!$F$4=\"英語 English/学位記氏名漢字 kanji\",'基本情報(Data)'!$F$4=\"日本語 Japanese\"),IF(COUNTBLANK('基本情報(Data)'!$G$8)=0,'基本情報(Data)'!$G$8,IF(COUNTBLANK('基本情報(Data)'!$G$6)=0,'基本情報(Data)'!$G$6,\"\")), IF(COUNTBLANK('基本情報(Data)'!$G$6)=0,'基本情報(Data)'!$G$6,\"\"))","v":""}]
{"$rows_left_out":30}
{"sheet":"Form3学位論文要旨","index":6,"n_rows":102,"n_cols":39,"rows_kept":102,"cut":false,"hidden":false,"merged":[[8,31,8,35],[8,36,8,61],[101,0,155,30],[101,31,155,61],[46,0,100,30],[46,31,100,61],[9,31,9,35],[9,36,9,61],[12,0,45,30],[11,31,11,43],[12,31,45,61],[11,0,11,12],[8,0,8,4],[8,5,8,30],[9,0,9,4],[9,5,9,30],[0,31,0,45],[2,38,2,52],[0,0,0,14],[2,7,2,21],[3,7,3,21],[5,0,5,4],[6,0,6,5],[5,6,5,30],[3,38,3,52],[5,31,5,35],[5,37,5,61],[6,31,6,36]]}
["別紙様式第３号（第4条関係）Form No.3",null,null,null,null,null,null,null,null,null,null,null,null,null,null,null,null,null,null,null,null,null,null,null,null,null,null,null,null,null,null,"別紙様式第３号（第4条関係）Form No.3"]
[]
[null,null,null,null,null,null,null,"学　位　論　文　要　旨",null,null,null,null,null,null,null,null,null,null,null,null,null,null,null,null,null,null,null,null,null,null,null,null,null,null,null,null,null,null,"学　位　論　文　要　旨"]
[null,null,null,null,null,null,null,"DISSERTATION SUMMARY",null,null,null,null,null,null,null,null,null,null,null,null,null,null,null,null,null,null,null,null,null,null,null,null,null,null,null,null,null,null,"DISSERTATION SUMMARY"]
[]
["氏　　　名",null,null,null,null,null,{"$f":"IF(COUNTBLANK('基本情報(Data)'!G8)=0,'基本情報(Data)'!G8, '基本情報(Data)'!G6)","v":""},null,null,null,null,null,null,null,null,null,null,null,null,null,null,null,null,null,null,null,null,null,null,null,null,"氏　　　名",null,null,null,null,null,{"$f":"IF(COUNTBLANK('基本情報(Data)'!G6)=0,'基本情報(Data)'!G6,\"\")","v":""}]
{"$rows_left_out":97}
{"sheet":"Form4履歴書","index":7,"n_rows":56,"n_cols":27,"rows_kept":56,"cut":false,"hidden":false,"merged":[[11,19,11,30],[60,9,60,32],[58,9,58,32],[56,9,56,32],[57,9,57,32],[55,9,55,32],[54,9,54,32],[53,0,53,32],[49,9,49,32],[47,9,47,32],[48,9,48,32],[50,9,50,32],[51,9,51,32],[52,9,52,32],[59,9,59,32],[59,0,59,8],[54,0,54,8],[55,0,55,8],[56,0,56,8],[57,0,57,8],[58,0,58,8],[60,0,60,8],[50,0,50,8],[51,0,51,8],[52,0,52,8],[46,9,46,32],[45,9,45,32],[34,9,34,32],[35,9,35,32],[36,9,36,32],[37,9,37,32],[38,9,38,32],[44,0,44,32],[39,9,39,32],[40,9,40,32],[41,9,41,32],[42,9,42,32],[43,9,43,32],[40,0,40,8],[41,0,41,8],[42,0,42,8],[43,0,43,8],[45,0,45,8],[46,0,46,8],[47,0,47,8],[48,0,48,8],[49,0,49,8],[22,9,22,32],[23,9,23,32],[24,9,24,32],[25,9,25,32],[26,9,26,32],[27,0,27,32],[28,9,28,32],[13,0,13,32],[14,0,14,32],[15,9,15,32],[16,9,16,32],[17,9,17,32],[18,9,18,32],[19,9,19,32],[20,9,20,32],[21,9,21,32],[15,0,15,8],[16,0,16,8],[17,0,17,8],[18,0,18,8],[19,0,19,8],[20,0,20,8],[21,0,21,8],[22,0,22,8],[0,0,0,21],[29,9,29,32],[30,9,30,32],[31,9,31,32],[32,9,32,32],[33,0,33,32],[7,13,7,15],[7,17,7,18],[7,20,7,21],[7,1,7,7],[9,1,9,7],[10,1,10,7],[11,1,11,7],[12,1,12,7],[8,1,8,7],[11,15,11,18],[11,10,11,14],[12,9,12,32],[8,15,8,17],[8,18,8,20],[8,21,8,23],[9,11,10,29],[23,0,23,8],[24,0,24,8],[3,1,3,7],[4,1,4,7],[5,1,5,7],[6,1,6,7],[3,26,4,32],[5,26,6,32],[4,9,6,25],[3,9,3,25],[2,0,2,32],[29,0,29,8],[30,0,30,8],[31,0,31,8],[25,0,25,8],[26,0,26,8],[39,0,39,8],[34,0,34,8],[35,0,35,8],[36,0,36,8],[37,0,37,8],[38,0,38,8],[32,0,32,8],[28,0,28,8]]}
["別紙様式第４号（第４条，第６条，第７条関係）　Form No.4"]
[]
["履　　　歴　　　書　　CURRICULUM VITAE"]
[null,"フリガナ",null,null,null,null,null,null,null,{"$f":"IF(COUNTBLANK('基本情報(Data)'!G10)=0,'基本情報(Data)'!G10,\"\")","v":""},null,null,null,null,null,null,null,null,null,null,null,null,null,null,null,null,{"$f":"IF('基本情報(Data)'!D12=\"男 Male\", \"男\", IF('基本情報(Data)'!D12=\"女 Female\", \"女\", IF('基本情報(Data)'!D12=\"その他 Other\", \"その他\",\"\")))","v":""}]
[null,"氏名",null,null,null,null,null,null,null,{"$f":"IF(OR('基本情報(Data)'!$F$4=\"英語 English/学位記氏名漢字 kanji\",'基本情報(Data)'!$F$4=\"日本語 Japanese\"),IF(COUNTBLANK('基本情報(Data)'!$G$8)=0,'基本情報(Data)'!$G$8,IF(COUNTBLANK('基本情報(Data)'!$G$6)=0,'基本情報(Data)'!$G$6,\"\")), IF(COUNTBLANK('基本情報(Data)'!$G$6)=0,'基本情報(Data)'!$G$6,\"\"))","v":""}]
[null,"Name (in Katakana)",null,null,null,null,null,null,null,null,null,null,null,null,null,null,null,null,null,null,null,null,null,null,null,null,{"$f":"IF('基本情報(Data)'!D12=\"男 Male\", \"Male\", IF('基本情報(Data)'!D12=\"女 Female\", \"Female\",IF('基本情報(Data)'!D12=\"その他 Other\", \"Other\",\"\")))","v":""}]
{"$rows_left_out":51}
{"sheet":"Form5承諾書","index":8,"n_rows":281,"n_cols":33,"rows_kept":281,"cut":false,"hidden":false,"merged":[[18,17,18,26],[65,17,65,26],[112,17,112,26],[159,17,159,26],[206,17,206,26],[253,17,253,26],[146,23,146,25],[193,23,193,25],[240,23,240,25],[252,17,252,21],[252,22,252,34],[246,0,246,25],[249,17,249,21],[249,22,249,34],[250,17,250,25],[250,32,250,34],[228,0,228,35],[229,0,229,35],[230,0,230,35],[224,0,224,35],[225,0,225,35],[226,0,226,35],[231,0,231,35],[232,0,232,35],[266,0,266,4],[267,0,267,4],[267,12,267,14],[267,16,267,18],[263,31,263,34],[264,30,264,34],[268,14,268,16],[268,18,268,20],[263,0,263,8],[263,9,263,30],[265,0,265,11],[265,20,265,29],[278,0,278,35],[279,0,279,35],[280,0,280,35],[270,0,270,4],[271,0,271,35],[272,0,272,35],[273,0,273,35],[270,16,270,35],[270,5,270,15],[274,0,274,14],[274,15,274,28],[274,29,274,35],[275,0,275,35],[276,0,276,35],[277,0,277,35],[255,0,255,4],[258,5,258,33],[260,0,260,4],[260,5,260,33],[247,0,247,35],[235,0,235,21],[237,0,237,35],[238,0,238,35],[240,27,240,28],[240,30,240,31],[241,25,241,27],[241,28,241,30],[241,31,241,33],[233,0,233,35],[221,14,221,16],[221,18,221,20],[223,0,223,4],[223,5,223,15],[223,16,223,35],[227,0,227,14],[227,15,227,28],[227,29,227,35],[216,0,216,8],[216,9,216,30],[218,0,218,11],[218,20,218,29],[219,0,219,4],[216,31,216,34],[217,30,217,34],[220,0,220,4],[220,12,220,14],[220,16,220,18],[211,5,211,33],[213,0,213,4],[213,5,213,33],[202,17,202,21],[202,22,202,34],[203,17,203,25],[203,32,203,34],[205,17,205,21],[205,22,205,34],[180,0,180,14],[180,15,180,28],[180,29,180,35],[177,0,177,35],[178,0,178,35],[179,0,179,35],[194,31,194,33],[199,0,199,25],[208,0,208,4],[200,0,200,35],[194,25,194,27],[194,28,194,30],[172,0,172,4],[173,0,173,4],[173,12,173,14],[173,16,173,18],[147,25,147,27],[147,28,147,30],[174,14,174,16],[174,18,174,20],[176,0,176,4],[166,0,166,4],[166,5,166,33],[158,22,158,34],[158,17,158,21],[155,17,155,21],[155,22,155,34],[169,0,169,8],[169,9,169,30],[171,0,171,11],[171,20,171,29],[176,5,176,15],[176,16,176,35],[156,32,156,34],[147,31,147,33],[152,0,152,25],[29,30,29,34],[25,0,25,4],[0,0,0,21],[20,0,20,4],[14,22,14,34],[17,22,17,34],[11,0,11,25],[5,27,5,28],[5,30,5,31],[6,25,6,27],[6,28,6,30],[6,31,6,33],[14,17,14,21],[17,17,17,21],[15,17,15,25],[23,5,23,33],[25,5,25,33],[2,0,2,35],[3,0,3,35],[28,0,28,8],[28,31,28,34],[12,0,12,35],[5,23,5,25],[15,31,15,34],[30,0,30,11],[39,15,39,28],[35,0,35,4],[40,0,40,35],[41,0,41,35],[31,0,31,4],[32,0,32,4],[32,12,32,14],[32,16,32,18],[30,20,30,29],[39,0,39,14],[39,29,39,35],[37,0,37,35],[36,0,36,35],[38,0,38,35],[35,5,35,15],[35,16,35,35],[50,0,50,35],[52,27,52,28],[52,30,52,31],[53,25,53,27],[53,28,53,30],[53,31,53,33],[52,23,52,25],[33,14,33,16],[33,18,33,20],[87,0,87,35],[88,0,88,35],[89,0,89,35],[90,0,90,35],[124,0,124,11],[124,20,124,29],[125,0,125,4],[126,0,126,4],[126,12,126,14],[126,16,126,18],[94,0,94,21],[122,9,122,30],[123,31,123,33],[122,31,122,34],[117,5,117,33],[100,31,100,33],[99,23,99,25],[105,0,105,25],[100,25,100,27],[100,28,100,30],[75,0,75,8],[75,9,75,30],[67,0,67,4],[72,0,72,4],[70,5,70,33],[72,5,72,33],[75,31,75,34],[76,30,76,34],[170,30,170,34],[129,5,129,15],[129,16,129,35],[133,0,133,14],[133,15,133,28],[133,29,133,35],[134,0,134,35],[135,0,135,35],[136,0,136,35],[137,0,137,35],[138,0,138,35],[139,0,139,35],[141,0,141,21],[143,0,143,35],[144,0,144,35],[153,0,153,35],[156,17,156,25],[161,0,161,4],[164,5,164,33],[111,17,111,21],[111,22,111,34],[130,0,130,35],[131,0,131,35],[132,0,132,35],[82,0,82,4],[114,0,114,4],[119,0,119,4],[84,0,84,35],[85,0,85,35],[91,0,91,35],[92,0,92,35],[96,0,96,35],[97,0,97,35],[83,0,83,35],[127,14,127,16],[127,18,127,20],[106,0,106,35],[86,0,86,14],[86,15,86,28],[86,29,86,35],[80,18,80,20],[193,27,193,28],[193,30,193,31],[181,0,181,35],[182,0,182,35],[183,0,183,35],[184,0,184,35],[185,0,185,35],[186,0,186,35],[188,0,188,21],[190,0,190,35],[191,0,191,35],[146,27,146,28],[146,30,146,31],[129,0,129,4],[108,17,108,21],[108,22,108,34],[109,17,109,25],[109,32,109,34],[169,31,169,34],[99,27,99,28],[99,30,99,31],[119,5,119,33],[122,0,122,8],[77,0,77,11],[77,20,77,29],[78,0,78,4],[79,0,79,4],[79,12,79,14],[79,16,79,18],[82,5,82,15],[82,16,82,35],[28,9,28,30],[80,14,80,16],[59,0,59,35],[61,17,61,21],[61,22,61,34],[62,17,62,25],[62,32,62,34],[64,17,64,21],[64,22,64,34],[42,0,42,35],[43,0,43,35],[44,0,44,35],[45,0,45,35],[58,0,58,25],[47,0,47,21],[49,0,49,35]]}
["別紙様式第5号（第４条，第６条関係）　Form No.5"]
[]
["承　　諾　　書"]
["LETTER OF CONSENT"]
[]
[null,null,null,null,null,null,null,null,null,null,null,null,null,null,null,null,null,null,null,null,null,null,null,null,null,null,"年",null,null,"月",null,null,"日"]
{"$rows_left_out":276}
{"sheet":"学位論文題目届 (Title of Dissertation)","index":9,"n_rows":37,"n_cols":22,"rows_kept":37,"cut":false,"hidden":false,"merged":[[28,2,28,9],[14,0,14,24],[35,0,36,2],[35,3,35,24],[36,3,36,24],[29,2,30,9],[31,2,31,9],[32,2,33,9],[23,2,27,9],[21,3,21,24],[18,0,18,24],[2,0,2,24],[3,0,3,24],[5,11,5,13],[6,10,7,23],[6,1,6,9],[7,1,7,9],[8,21,8,23],[12,21,12,23],[23,10,27,16],[28,10,30,16],[31,10,33,16],[23,17,27,23],[28,17,30,23],[31,17,33,23],[9,11,9,13],[15,0,15,24],[20,0,21,2],[20,3,20,24],[10,1,10,9],[17,0,17,24],[10,12,11,23],[11,1,11,11]]}
[]
[]
["学 位 論 文 題 目 届"]
["Notification of Title of Dissertation"]
[]
[null,null,null,null,null,null,null,null,null,null,null,"（自署）"]
{"$rows_left_out":32}
{"sheet":"研究題目変更願(request for change)","index":10,"n_rows":40,"n_cols":30,"rows_kept":40,"cut":false,"hidden":false,"merged":[[39,2,39,30],[36,0,36,4],[34,5,34,30],[16,17,16,30],[18,17,18,30],[32,5,32,30],[32,0,32,4],[34,0,34,4],[38,2,38,30],[30,0,30,30],[36,5,36,12],[19,11,19,16],[1,20,1,22],[27,0,27,30],[28,0,28,30],[1,24,1,25],[1,27,1,28],[2,22,2,24],[2,25,2,27],[2,28,2,30],[40,2,40,30],[6,0,6,30],[22,28,22,30],[25,28,25,30],[9,0,9,26],[10,0,10,26],[12,11,12,14],[14,11,14,14],[16,11,16,14],[18,11,18,14],[12,17,12,24],[21,11,21,14],[21,16,21,29],[24,16,24,29],[7,0,7,30],[14,17,14,30]]}
[]
[null,null,null,null,null,null,null,null,null,null,null,null,null,null,null,null,null,null,null,null,null,null,null,"年",null,null,"月",null,null,"日"]
[null,null,null,null,null,null,null,null,null,null,null,null,null,null,null,null,null,null,null,null,null,null,"year",null,null,"month",null,null,"day"]
[]
[]
[]
{"$rows_left_out":35}
{"sheet":"機関リポジトリ登録申請書(Repository)","index":11,"n_rows":71,"n_cols":33,"rows_kept":71,"cut":false,"hidden":false,"merged":[[15,0,15,6],[16,0,16,6],[12,2,12,31],[14,0,14,6],[14,26,14,29],[1,0,1,34],[2,0,2,34],[4,22,4,25],[4,27,4,28],[4,30,4,31],[5,24,5,32],[8,0,8,15],[10,2,10,31],[7,0,7,15],[14,30,14,34],[25,7,25,34],[22,0,22,6],[25,0,25,6],[43,10,44,34],[48,18,48,19],[48,21,48,22],[48,24,48,25],[24,25,24,30],[26,9,28,34],[29,13,30,34],[31,13,31,34],[32,7,32,34],[29,9,30,12],[41,10,41,34],[30,0,30,6],[29,0,29,6],[21,32,22,33],[20,0,20,6],[20,25,20,30],[23,0,23,6],[15,7,15,13],[24,9,24,15],[24,17,24,23],[21,0,21,6],[17,0,18,6],[15,14,15,22],[21,9,22,15],[21,17,22,23],[21,25,22,30],[20,9,20,15],[24,0,24,6],[20,17,20,23],[20,7,24,8],[15,26,15,29],[15,30,18,34],[16,26,18,29],[17,7,17,11],[16,7,16,22],[17,12,17,24],[18,7,18,22],[15,23,15,24],[70,9,70,10],[68,23,68,27],[68,9,68,10],[34,0,34,6],[31,0,31,6],[33,0,33,6],[35,0,35,6],[68,11,70,21],[66,0,72,6],[61,8,61,34],[70,23,70,28],[68,29,70,34],[60,7,60,34],[63,8,63,34],[62,7,62,34],[36,7,36,34],[36,0,58,6],[51,10,51,34],[52,10,52,34],[53,10,53,34],[54,10,54,34],[48,10,48,15],[40,7,40,34],[45,7,45,34],[60,0,65,6],[64,7,65,34],[33,8,33,33],[34,8,34,33],[26,7,31,8],[33,7,35,7],[31,9,31,12],[35,8,35,34],[37,10,37,34],[55,10,57,34],[59,0,59,34],[38,10,38,34],[39,10,39,34],[50,7,50,34],[47,10,47,34],[49,11,49,13],[49,21,49,24],[49,25,49,31],[49,14,49,20],[42,10,42,34],[46,10,46,34],[26,0,26,6],[27,0,27,6],[28,0,28,6]]}
[]
["機関リポジトリ登録申請書"]
["Institutional Repository Registration Application Form"]
[]
[null,null,null,null,null,null,null,null,null,null,null,null,null,null,null,null,null,null,null,null,null,null,null,null,null,null,"年",null,null,"月",null,null,"日"]
[null,null,null,null,null,null,null,null,null,null,null,null,null,null,null,null,null,null,null,null,null,"Date:",null,null,"(yyyy/mm/dd)"]
{"$rows_left_out":66}
{"sheet":"英文氏名国名届(Name and nationality)","index":12,"n_rows":27,"n_cols":8,"rows_kept":27,"cut":false,"hidden":false,"merged":[[22,2,22,32],[24,2,24,32],[5,0,5,32],[22,0,22,1],[26,2,28,32],[4,0,4,32],[15,0,15,4],[9,0,9,4],[9,7,10,32],[15,7,16,32]]}
[]
[]
[]
[]
["英文の氏名及び国名届（外国人のみ）"]
["English spelling of applicant’s name and nationality (foreign applicants only)"]
{"$rows_left_out":21}